{"text_format":"1","workbook":"xlsx","n_sheets":4,"sheets":["Instructions","AG2 Data","Data","Report"],"not_rendered":{"charts":8,"images":6,"macros":0,"external_links":1,"defined_names":10,"comments":2,"pivot_tables":0},"unopened":[],"bounds":{"document_bytes":16777216,"sheet_cells":100000,"rows_first":2000,"rows_last":500,"rows_between":2000,"halvings":0,"cell_chars":16384,"cell_head_chars":4096},"cells_cut":0,"cells_raw":0,"read":"whole","date_system":"1900"}

{"sheet":"Instructions","index":0,"n_rows":139,"n_cols":7,"rows_kept":139,"cut":false,"hidden":false,"merged":[]}
["This spreadsheet is provided to assist you in collecting data for quality control testing"]
["of a mammographic x-ray unit."]
[]
["The tab following this Instruction sheet is the sheet on which you will import the"]
["generator test data from your Accu-Gold system. To simplify the analysis, it is"]
["recommended that the template as presented by followed as closely as possible. If"]
["a generator does not have one of the indicated settings and that row is not used,"]
["do not delete the row from the spreadsheet; rather, just clear the cells of that row"]
["of any entries."]
[]
["The cells on the Data sheet are color coded as follows:",null,null,null,null,null,"Sheet"]
["Green","cells are for data that is collected from AG2 software.",null,null,null,null,"AG2 Data "]
["Yellow","cells are where you enter information specific to your testing session",null,null,null,null,"AG2 Data"]
[]
["The Report sheet is calculated and completed automatically. Except for pasting the"]
["waveform, your intervention should not be required."]
[]
["The Windows snipping tool can be used to copy  a screen shot of the waveform."]
[]
[]
[]
[]
[]
[]
[]
[]
[]
[]
[]
[]
[]
[]
[]
[]
[]
[]
[]
[]
["Prior to measuring set the unit of measure."]
["This can be done by accessing the \"unit\" settings on the \"List\" tab. "]
[]
[]
[]
[]
[]
[]
[]
[]
[]
[]
[]
[]
[]
[]
[]
[]
[]
[]
[]
[]
[]
[]
[]
[]
[]
[]
["Getting started"]
["Open Accu-Gold 2 and activate \"Companion Mode\""]
[]
[]
[]
[]
[]
[]
[]
[]
[]
[]
[]
[]
[]
[]
[]
["If the software is already open you can just click the \"Toggle\" button"]
[]
[]
[]
[]
[]
[]
[]
[]
[]
[]
[]
[]
[]
[]
[]
[]
[]
[]
[]
["Accu-Gold 2 will automatically re-size the template and application so they can be viewed"]
["simultaneously. "]
[]
[]
[]
[]
[]
[]
[]
[]
[]
[]
[]
[]
[]
[]
[]
[]
["The starting cell \"E3\" will automatically be selected. "]
[]
["On Accu-Gold 2 with Accu-Gold format selected click the \"Get Cell\" button"]
["and check the auto-send box. "]
[]
["You can press the \"Start\" button and begin measuring when the software "]
["is in the \"Ready\" state. "]
[]
["Exposures can be redone by selecting any cell in column \"E\" of the exposure line then using "]
["the \"Get Cell\" button on AccuGold 2."]
[]
[]
["Please Note ---"]
["These templates are provided with the compliments of Radcal Corporation as samples and "]
["are available for modification by the user. Certain cells are locked and protected but may be "]
["unlocked without a password. (Use Tools/Protection/Unprotect Workbook/[enter])"]
["Radcal assumes no responsibility or liability for any unintentional errors."]
["It remains the user's responsibility to validate the calculations and to confirm suitability for the particular purpose."]

{"sheet":"AG2 Data","index":1,"n_rows":28,"n_cols":122,"rows_kept":28,"cut":false,"hidden":false,"merged":[[1,37,1,38],[1,117,1,118],[0,0,0,4],[0,5,0,118],[1,6,1,7],[1,8,1,9],[1,10,1,11],[1,12,1,13],[1,14,1,15]]}
["Machine Settings",null,null,null,null,"Measured Data"]
["Set kV","mAs","Target/Filter","Focal Spot","Index","Date","Time",null,"kVp",null,"Dose",null,"Dose Rate",null,"HVL",null,null,null,null,null,null,null,null,null,null,null,null,null,null,null,null,null,null,null,null,null,null,"Average kV",null,null,null,null,null,null,null,null,null,null,null,null,null,null,null,null,null,null,null,null,null,null,null,null,null,null,null,null,null,null,null,null,null,null,null,null,null,null,null,null,null,null,null,null,null,null,null,null,null,null,null,null,null,null,null,null,null,null,null,null,null,null,null,null,null,null,null,null,null,null,null,null,null,null,null,null,null,null,null,"Filtration"]
[{"$f":"Data!A39","v":24},{"$f":"Data!B39","v":100},"Mo/Mo",{"$f":"Data!D39","v":"L"},"1","2022-04-25T15:56:23.433",1.0709,"s",23.8,"kV",653.6,"mR",610.4,"mR/s",0.36,"mm",1,null,"USB",1,46.7,"Hz",null,null,null,null,null,null,null,"Standard","Multi-Sensor","Diagnostic","General",3.2269999999999999,"mm",120.2,"kV",119.8,"kV",null,null,null,null,1,null,null,3.1130000000000001E-2,"s",null,null,null,null,null,null,null,null,null,null,null,null,null,null,null,null,null,null,null,null,null,null,null,null,null,null,null,null,null,null,null,null,null,null,null,null,null,null,null,null,null,null,null,null,null,null,null,null,null,null,null,null,null,null,null,null,120.2,"kV",null,"43-0001",null,null,null,null,null,null,null,null,null,3.2269999999999999,"mm",32.6,"kV",""]
[{"$f":"Data!A40","v":25},{"$f":"Data!B40","v":100},"Mo/Mo",{"$f":"Data!D40","v":"L"},2,"2022-04-25T15:56:38.732",0.99939999999999996,"s",24.9,"kV",764.9,"mR",765.4,"mR/s",0.37,"mm",1,null,"USB",1,7.8,"Hz",null,null,null,null,null,null,null,"Standard","Multi-Sensor","Diagnostic","General",3.2269999999999999,"mm",120.2,"kV",119.8,"kV",null,null,null,null,1,null,null,0.13850000000000001,"s",null,null,null,null,null,null,null,null,null,null,null,null,null,null,null,null,null,null,null,null,null,null,null,null,null,null,null,null,null,null,null,null,null,null,null,null,null,null,null,null,null,null,null,null,null,null,null,null,null,null,null,null,null,null,null,null,120.2,"kV",null,"43-0001",null,null,null,null,null,2572,"mR/s",4.6980000000000004,"mm",3.2269999999999999,"mm",119.8,"kV"]
[{"$f":"Data!A41","v":26},{"$f":"Data!B41","v":100},"Mo/Mo",{"$f":"Data!D41","v":"L"},3,"2022-04-25T15:56:44.610",0.99919999999999998,"s",26,"kV",878.4,"mR",879.1,"mR/s",0.38,"mm",1,null,"USB",1,6.7,"Hz",null,null,null,null,null,null,null,"Standard","Multi-Sensor","Diagnostic","General",3.2269999999999999,"mm",120.2,"kV",119.8,"kV",null,null,null,null,1,null,null,0.15909999999999999,"s",null,null,null,null,null,null,null,null,null,null,null,null,null,null,null,null,null,null,null,null,null,null,null,null,null,null,null,null,null,null,null,null,null,null,null,null,null,null,null,null,null,null,null,null,null,null,null,null,null,null,null,null,null,null,null,null,120.2,"kV",null,"43-0001",null,null,null,null,null,2572,"mR/s",4.6980000000000004,"mm",3.2269999999999999,"mm",119.8,"kV"]
[{"$f":"Data!A42","v":27},{"$f":"Data!B42","v":100},"Mo/Mo",{"$f":"Data!D42","v":"L"},4,"2022-04-25T15:56:55.107",0.99929999999999997,"s",27,"kV",995.3,"mR",996,"mR/s",0.39,"mm",1,null,"USB",1,6.1,"Hz",null,null,null,null,null,null,null,"Standard","Multi-Sensor","Diagnostic","General",3.2269999999999999,"mm",120.2,"kV",119.8,"kV",null,null,null,null,1,null,null,0.1739,"s",null,null,null,null,null,null,null,null,null,null,null,null,null,null,null,null,null,null,null,null,null,null,null,null,null,null,null,null,null,null,null,null,null,null,null,null,null,null,null,null,null,null,null,null,null,null,null,null,null,null,null,null,null,null,null,null,120.2,"kV",null,"43-0001",null,null,null,null,null,2572,"mR/s",4.6980000000000004,"mm",3.2269999999999999,"mm",119.8,"kV"]
[{"$f":"Data!A43","v":28},{"$f":"Data!B43","v":100},"Mo/Mo",{"$f":"Data!D43","v":"L"},5,"2022-04-25T15:57:06.004",0.99870000000000003,"s",28.1,"kV",1116,"mR",1117,"mR/s",0.4,"mm",1,null,"USB",1,12.8,"Hz",null,null,null,null,null,null,null,"Standard","Multi-Sensor","Diagnostic","General",3.2269999999999999,"mm",120.2,"kV",119.8,"kV",null,null,null,null,1,null,null,8.8169999999999998E-2,"s",null,null,null,null,null,null,null,null,null,null,null,null,null,null,null,null,null,null,null,null,null,null,null,null,null,null,null,null,null,null,null,null,null,null,null,null,null,null,null,null,null,null,null,null,null,null,null,null,null,null,null,null,null,null,null,null,120.2,"kV",null,"43-0001",null,null,null,null,null,null,null,null,null,3.2269999999999999,"mm"]
[{"$f":"Data!A44","v":28},{"$f":"Data!B44","v":100},"Mo/Mo",{"$f":"Data!D44","v":"L"},6,"2022-04-25T15:57:08.677",0.99880000000000002,"s",28.1,"kV",1116,"mR",1117,"mR/s",0.3,"mm",1,null,"USB",1,8.1,"Hz",null,null,null,null,null,null,null,"Standard","Multi-Sensor","Diagnostic","General",3.2269999999999999,"mm",120.2,"kV",119.8,"kV",null,null,null,null,1,null,null,0.13270000000000001,"s",null,null,null,null,null,null,null,null,null,null,null,null,null,null,null,null,null,null,null,null,null,null,null,null,null,null,null,null,null,null,null,null,null,null,null,null,null,null,null,null,null,null,null,null,null,null,null,null,null,null,null,null,null,null,null,null,120.2,"kV",null,"43-0001",null,null,null,null,null,2572,"mR/s",4.6980000000000004,"mm",3.2269999999999999,"mm",119.8,"kV"]
[{"$f":"Data!A45","v":28},{"$f":"Data!B45","v":100},"Mo/Mo",{"$f":"Data!D45","v":"L"},7,"2022-04-25T15:57:11.603",0.99890000000000001,"s",28.1,"kV",1115,"mR",1117,"mR/s",0.3,"mm",1,null,"USB",1,6,"Hz",null,null,null,null,null,null,null,"Standard","Multi-Sensor","Diagnostic","General",3.2269999999999999,"mm",120.2,"kV",119.8,"kV",null,null,null,null,1,null,null,0.17610000000000001,"s",null,null,null,null,null,null,null,null,null,null,null,null,null,null,null,null,null,null,null,null,null,null,null,null,null,null,null,null,null,null,null,null,null,null,null,null,null,null,null,null,null,null,null,null,null,null,null,null,null,null,null,null,null,null,null,null,120.2,"kV",null,"43-0001",null,null,null,null,null,2572,"mR/s",4.6980000000000004,"mm",3.2269999999999999,"mm",119.8,"kV"]
[{"$f":"Data!A46","v":28},{"$f":"Data!B46","v":100},"Mo/Mo",{"$f":"Data!D46","v":"L"},8,"2022-04-25T15:57:14.683",0.99850000000000005,"s",28.1,"kV",1116,"mR",1118,"mR/s",0.3,"mm",1,null,"USB",1,7.5,"Hz",null,null,null,null,null,null,null,"Standard","Multi-Sensor","Diagnostic","General",3.2269999999999999,"mm",120.2,"kV",119.8,"kV",null,null,null,null,1,null,null,0.14369999999999999,"s",null,null,null,null,null,null,null,null,null,null,null,null,null,null,null,null,null,null,null,null,null,null,null,null,null,null,null,null,null,null,null,null,null,null,null,null,null,null,null,null,null,null,null,null,null,null,null,null,null,null,null,null,null,null,null,null,120.2,"kV",null,"43-0001",null,null,null,null,null,2572,"mR/s",4.6980000000000004,"mm",3.2269999999999999,"mm",119.8,"kV"]
[{"$f":"Data!A47","v":29},{"$f":"Data!B47","v":100},"Mo/Mo",{"$f":"Data!D47","v":"L"},9,"2022-04-25T15:57:17.568",0.99760000000000004,"s",29.3,"kV",1240,"mR",1243,"mR/s",0.31,"mm",1,null,"USB",1,5.7,"Hz",null,null,null,null,null,null,null,"Standard","Multi-Sensor","Diagnostic","General",3.2269999999999999,"mm",120.2,"kV",119.8,"kV",null,null,null,null,1,null,null,0.18429999999999999,"s",null,null,null,null,null,null,null,null,null,null,null,null,null,null,null,null,null,null,null,null,null,null,null,null,null,null,null,null,null,null,null,null,null,null,null,null,null,null,null,null,null,null,null,null,null,null,null,null,null,null,null,null,null,null,null,null,120.2,"kV",null,"43-0001",null,null,null,null,null,2572,"mR/s",4.6980000000000004,"mm",3.2269999999999999,"mm",119.8,"kV"]
[{"$f":"Data!A48","v":30},{"$f":"Data!B48","v":100},"Mo/Mo",{"$f":"Data!D48","v":"L"},10,"2022-04-25T15:57:20.643",0.998,"s",30.4,"kV",1369,"mR",1371,"mR/s",0.32,"mm",1,null,"USB",1,6.5,"Hz",null,null,null,null,null,null,null,"Standard","Multi-Sensor","Diagnostic","General",3.2269999999999999,"mm",120.2,"kV",119.8,"kV",null,null,null,null,1,null,null,0.1628,"s",null,null,null,null,null,null,null,null,null,null,null,null,null,null,null,null,null,null,null,null,null,null,null,null,null,null,null,null,null,null,null,null,null,null,null,null,null,null,null,null,null,null,null,null,null,null,null,null,null,null,null,null,null,null,null,null,120.2,"kV",null,"43-0001",null,null,null,null,null,2572,"mR/s",4.6980000000000004,"mm",3.2269999999999999,"mm",119.8,"kV"]
[{"$f":"Data!A49","v":32},{"$f":"Data!B49","v":100},"Mo/Mo",{"$f":"Data!D49","v":"L"},11,"2022-04-25T15:57:23.517",1.0647,"s",32.4,"kV",1643,"mR",1543,"mR/s",0.33,"mm",1,null,"USB",1,6.8,"Hz",null,null,null,null,null,null,null,"Standard","Multi-Sensor","Diagnostic","General",3.2269999999999999,"mm",120.2,"kV",119.8,"kV",null,null,null,null,1,null,null,0.15740000000000001,"s",null,null,null,null,null,null,null,null,null,null,null,null,null,null,null,null,null,null,null,null,null,null,null,null,null,null,null,null,null,null,null,null,null,null,null,null,null,null,null,null,null,null,null,null,null,null,null,null,null,null,null,null,null,null,null,null,120.2,"kV",null,"43-0001",null,null,null,null,null,2572,"mR/s",4.6980000000000004,"mm",3.2269999999999999,"mm",119.8,"kV"]
[{"$f":"Data!A50","v":28},{"$f":"Data!B50","v":25},"Mo/Mo",{"$f":"Data!D50","v":"L"},12,"2022-04-25T15:57:26.387",0.24890000000000001,"s",28,"kV",274.2,"mR",1102,"mR/s",0.28999999999999998,"mm",1,null,"USB",1,5.2,"Hz",null,null,null,null,null,null,null,"Standard","Multi-Sensor","Diagnostic","General",3.2269999999999999,"mm",120.2,"kV",119.8,"kV",null,null,null,null,1,null,null,0.20069999999999999,"s",null,null,null,null,null,null,null,null,null,null,null,null,null,null,null,null,null,null,null,null,null,null,null,null,null,null,null,null,null,null,null,null,null,null,null,null,null,null,null,null,null,null,null,null,null,null,null,null,null,null,null,null,null,null,null,null,120.2,"kV",null,"43-0001",null,null,null,null,null,2572,"mR/s",4.6980000000000004,"mm",3.2269999999999999,"mm",119.8,"kV"]
[{"$f":"Data!A51","v":28},{"$f":"Data!B51","v":50},"Mo/Mo",{"$f":"Data!D51","v":"L"},13,"2022-04-25T15:57:29.264",0.49869999999999998,"s",28.1,"kV",554.4,"mR",1112,"mR/s",0.3,"mm",1,null,"USB",1,6.7,"Hz",null,null,null,null,null,null,null,"Standard","Multi-Sensor","Diagnostic","General",3.2269999999999999,"mm",120.2,"kV",119.8,"kV",null,null,null,null,1,null,null,0.15890000000000001,"s",null,null,null,null,null,null,null,null,null,null,null,null,null,null,null,null,null,null,null,null,null,null,null,null,null,null,null,null,null,null,null,null,null,null,null,null,null,null,null,null,null,null,null,null,null,null,null,null,null,null,null,null,null,null,null,null,120.2,"kV",null,"43-0001",null,null,null,null,null,2572,"mR/s",4.6980000000000004,"mm",3.2269999999999999,"mm",119.8,"kV"]
[{"$f":"Data!A52","v":28},{"$f":"Data!B52","v":200},"Mo/Mo",{"$f":"Data!D52","v":"L"},14,"2022-04-25T15:57:32.164",1.9985999999999999,"s",28.1,"kV",2239,"mR",1120,"mR/s",0.3,"mm",1,null,"USB",1,6,"Hz",null,null,null,null,null,null,null,"Standard","Multi-Sensor","Diagnostic","General",3.2269999999999999,"mm",120.2,"kV",119.8,"kV",null,null,null,null,1,null,null,0.17749999999999999,"s",null,null,null,null,null,null,null,null,null,null,null,null,null,null,null,null,null,null,null,null,null,null,null,null,null,null,null,null,null,null,null,null,null,null,null,null,null,null,null,null,null,null,null,null,null,null,null,null,null,null,null,null,null,null,null,null,120.2,"kV",null,"43-0001",null,null,null,null,null,2572,"mR/s",4.6980000000000004,"mm",3.2269999999999999,"mm",119.8,"kV"]
[{"$f":"Data!A53","v":28},{"$f":"Data!B53","v":320},"Mo/Mo",{"$f":"Data!D53","v":"L"},15,"2022-04-25T15:57:35.049",3.1985000000000001,"s",28.1,"kV",3587,"mR",1122,"mR/s",0.3,"mm",1,null,"USB",1,6.5,"Hz",null,null,null,null,null,null,null,"Standard","Multi-Sensor","Diagnostic","General",3.2269999999999999,"mm",120.2,"kV",119.8,"kV",null,null,null,null,1,null,null,0.16420000000000001,"s",null,null,null,null,null,null,null,null,null,null,null,null,null,null,null,null,null,null,null,null,null,null,null,null,null,null,null,null,null,null,null,null,null,null,null,null,null,null,null,null,null,null,null,null,null,null,null,null,null,null,null,null,null,null,null,null,120.2,"kV",null,"43-0001",null,null,null,null,null,2572,"mR/s",4.6980000000000004,"mm",3.2269999999999999,"mm",119.8,"kV"]
[{"$f":"Data!A54","v":28},{"$f":"Data!B54","v":100},"Mo/Rh",{"$f":"Data!D54","v":"L"},16,"2022-04-25T15:57:37.946",0.99880000000000002,"s",28.1,"kV",915.6,"mR",916.7,"mR/s",0.36,"mm",1,null,"USB",1,6.5,"Hz",null,null,null,null,null,null,null,"Standard","Multi-Sensor","Diagnostic","General",3.2269999999999999,"mm",120.2,"kV",119.8,"kV",null,null,null,null,1,null,null,0.16370000000000001,"s",null,null,null,null,null,null,null,null,null,null,null,null,null,null,null,null,null,null,null,null,null,null,null,null,null,null,null,null,null,null,null,null,null,null,null,null,null,null,null,null,null,null,null,null,null,null,null,null,null,null,null,null,null,null,null,null,120.2,"kV",null,"43-0001",null,null,null,null,null,2572,"mR/s",4.6980000000000004,"mm",3.2269999999999999,"mm",119.8,"kV"]
[{"$f":"Data!A55","v":28},{"$f":"Data!B55","v":100},"Rh/Rh",{"$f":"Data!D55","v":"L"},17,"2022-04-25T15:57:40.822",1.6116999999999999,"s",27.8,"kV",850.4,"mR",527.6,"mR/s",0.37,"mm",1,null,"USB",1,6.9,"Hz",null,null,null,null,null,null,null,"Standard","Multi-Sensor","Diagnostic","General",3.2269999999999999,"mm",120.2,"kV",119.8,"kV",null,null,null,null,1,null,null,0.15529999999999999,"s",null,null,null,null,null,null,null,null,null,null,null,null,null,null,null,null,null,null,null,null,null,null,null,null,null,null,null,null,null,null,null,null,null,null,null,null,null,null,null,null,null,null,null,null,null,null,null,null,null,null,null,null,null,null,null,null,120.2,"kV",null,"43-0001",null,null,null,null,null,2572,"mR/s",4.6980000000000004,"mm",3.2269999999999999,"mm",119.8,"kV"]
[{"$f":"Data!A56","v":28},{"$f":"Data!B56","v":100},"Rh/Al",{"$f":"Data!D56","v":"L"},18,"2022-04-25T15:57:43.699",0.1321,"s",28.1,"kV",338.8,"mR",2572,"mR/s",0.36,"mm",1,null,"USB",1,8.1999999999999993,"Hz",null,null,null,null,null,null,null,"Standard","Multi-Sensor","Diagnostic","General",3.2269999999999999,"mm",120.2,"kV",119.8,"kV",null,null,null,null,1,null,null,0.13170000000000001,"s",null,null,null,null,null,null,null,null,null,null,null,null,null,null,null,null,null,null,null,null,null,null,null,null,null,null,null,null,null,null,null,null,null,null,null,null,null,null,null,null,null,null,null,null,null,null,null,null,null,null,null,null,null,null,null,null,120.2,"kV",null,"43-0001",null,null,null,null,null,2572,"mR/s",4.6980000000000004,"mm",3.2269999999999999,"mm",119.8,"kV"]
[{"$f":"Data!A57","v":28},{"$f":"Data!B57","v":100},"W/Rh",{"$f":"Data!D57","v":"L"},19,"2022-04-25T15:57:47.578",0.14510000000000001,"s",28.1,"kV",372.6,"mR",2572,"mR/s",0.36,"mm",1,null,"USB",1,7.4,"Hz",null,null,null,null,null,null,null,"Standard","Multi-Sensor","Diagnostic","General",3.2269999999999999,"mm",120.2,"kV",119.8,"kV",null,null,null,null,1,null,null,0.1447,"s",null,null,null,null,null,null,null,null,null,null,null,null,null,null,null,null,null,null,null,null,null,null,null,null,null,null,null,null,null,null,null,null,null,null,null,null,null,null,null,null,null,null,null,null,null,null,null,null,null,null,null,null,null,null,null,null,120.2,"kV",null,"43-0001",null,null,null,null,null,2572,"mR/s",4.6980000000000004,"mm",3.2269999999999999,"mm",119.8,"kV"]
[{"$f":"Data!A58","v":28},{"$f":"Data!B58","v":100},"W/Ag",{"$f":"Data!D58","v":"L"},20,"2022-04-25T15:57:51.650",0.16420000000000001,"s",28.1,"kV",421.8,"mR",2572,"mR/s",0.36,"mm",1,null,"USB",1,6.5,"Hz",null,null,null,null,null,null,null,"Standard","Multi-Sensor","Diagnostic","General",3.2269999999999999,"mm",120.2,"kV",119.8,"kV",null,null,null,null,1,null,null,0.16389999999999999,"s",null,null,null,null,null,null,null,null,null,null,null,null,null,null,null,null,null,null,null,null,null,null,null,null,null,null,null,null,null,null,null,null,null,null,null,null,null,null,null,null,null,null,null,null,null,null,null,null,null,null,null,null,null,null,null,null,120.2,"kV",null,"43-0001",null,null,null,null,null,2572,"mR/s",4.6980000000000004,"mm",3.2269999999999999,"mm",119.8,"kV"]
[{"$f":"Data!A59","v":28},{"$f":"Data!B59","v":25},"Mo/Mo",{"$f":"Data!D59","v":"S"},21,"2022-04-25T15:57:54.334",0.27339999999999998,"s",28.1,"kV",702,"mR",2572,"mR/s",0.36,"mm",1,null,"USB",1,3.8,"Hz",null,null,null,null,null,null,null,"Standard","Multi-Sensor","Diagnostic","General",3.2269999999999999,"mm",120.2,"kV",119.8,"kV",null,null,null,null,1,null,null,0.27289999999999998,"s",null,null,null,null,null,null,null,null,null,null,null,null,null,null,null,null,null,null,null,null,null,null,null,null,null,null,null,null,null,null,null,null,null,null,null,null,null,null,null,null,null,null,null,null,null,null,null,null,null,null,null,null,null,null,null,null,120.2,"kV",null,"43-0001",null,null,null,null,null,2572,"mR/s",4.6980000000000004,"mm",3.2269999999999999,"mm",119.8,"kV"]
[{"$f":"Data!A60","v":28},{"$f":"Data!B60","v":25},"Mo/Rh",{"$f":"Data!D60","v":"S"},22,"2022-04-25T15:57:57.236",0.16700000000000001,"s",28.1,"kV",428.8,"mR",2572,"mR/s",0.36,"mm",1,null,"USB",1,6.4,"Hz",null,null,null,null,null,null,null,"Standard","Multi-Sensor","Diagnostic","General",3.2269999999999999,"mm",120.2,"kV",119.8,"kV",null,null,null,null,1,null,null,0.16669999999999999,"s",null,null,null,null,null,null,null,null,null,null,null,null,null,null,null,null,null,null,null,null,null,null,null,null,null,null,null,null,null,null,null,null,null,null,null,null,null,null,null,null,null,null,null,null,null,null,null,null,null,null,null,null,null,null,null,null,120.2,"kV",null,"43-0001",null,null,null,null,null,2572,"mR/s",4.6980000000000004,"mm",3.2269999999999999,"mm",119.8,"kV"]
[{"$f":"Data!A61","v":28},{"$f":"Data!B61","v":25},"Rh/Rh",{"$f":"Data!D61","v":"S"},23,"2022-04-25T15:58:00.125",0.1522,"s",28.1,"kV",390.7,"mR",2572,"mR/s",0.36,"mm",1,null,"USB",1,7,"Hz",null,null,null,null,null,null,null,"Standard","Multi-Sensor","Diagnostic","General",3.2269999999999999,"mm",120.2,"kV",119.8,"kV",null,null,null,null,1,null,null,0.15190000000000001,"s",null,null,null,null,null,null,null,null,null,null,null,null,null,null,null,null,null,null,null,null,null,null,null,null,null,null,null,null,null,null,null,null,null,null,null,null,null,null,null,null,null,null,null,null,null,null,null,null,null,null,null,null,null,null,null,null,120.2,"kV",null,"43-0001",null,null,null,null,null,2572,"mR/s",4.6980000000000004,"mm",3.2269999999999999,"mm",119.8,"kV"]
[{"$f":"Data!A62","v":28},{"$f":"Data!B62","v":25},"Rh/Al",{"$f":"Data!D62","v":"S"},24,"2022-04-25T15:58:03.212",0.1714,"s",28.1,"kV",440,"mR",2572,"mR/s",0.36,"mm",1,null,"USB",1,6.2,"Hz",null,null,null,null,null,null,null,"Standard","Multi-Sensor","Diagnostic","General",3.2269999999999999,"mm",120.2,"kV",119.8,"kV",null,null,null,null,1,null,null,0.17100000000000001,"s",null,null,null,null,null,null,null,null,null,null,null,null,null,null,null,null,null,null,null,null,null,null,null,null,null,null,null,null,null,null,null,null,null,null,null,null,null,null,null,null,null,null,null,null,null,null,null,null,null,null,null,null,null,null,null,null,120.2,"kV",null,"43-0001",null,null,null,null,null,2572,"mR/s",4.6980000000000004,"mm",3.2269999999999999,"mm",119.8,"kV"]
[{"$f":"Data!A63","v":28},{"$f":"Data!B63","v":25},"W/Rh",{"$f":"Data!D63","v":"S"},25,"2022-04-25T15:58:06.294",0.15690000000000001,"s",28.1,"kV",402.6,"mR",2572,"mR/s",0.36,"mm",1,null,"USB",1,6.8,"Hz",null,null,null,null,null,null,null,"Standard","Multi-Sensor","Diagnostic","General",3.2269999999999999,"mm",120.2,"kV",119.8,"kV",null,null,null,null,1,null,null,0.1565,"s",null,null,null,null,null,null,null,null,null,null,null,null,null,null,null,null,null,null,null,null,null,null,null,null,null,null,null,null,null,null,null,null,null,null,null,null,null,null,null,null,null,null,null,null,null,null,null,null,null,null,null,null,null,null,null,null,120.2,"kV",null,"43-0001",null,null,null,null,null,2572,"mR/s",4.6980000000000004,"mm",3.2269999999999999,"mm",119.8,"kV"]
[{"$f":"Data!A64","v":28},{"$f":"Data!B64","v":25},"W/Ag",{"$f":"Data!D64","v":"S"},26,"2022-04-25T15:58:09.162",0.1598,"s",28.1,"kV",409.9,"mR",2572,"mR/s",0.36,"mm",1,null,"USB",1,6.7,"Hz",null,null,null,null,null,null,null,"Standard","Multi-Sensor","Diagnostic","General",3.2269999999999999,"mm",120.2,"kV",119.8,"kV",null,null,null,null,1,null,null,0.15920000000000001,"s",null,null,null,null,null,null,null,null,null,null,null,null,null,null,null,null,null,null,null,null,null,null,null,null,null,null,null,null,null,null,null,null,null,null,null,null,null,null,null,null,null,null,null,null,null,null,null,null,null,null,null,null,null,null,null,null,120.2,"kV",null,"43-0001",null,null,null,null,null,2572,"mR/s",4.6980000000000004,"mm",3.226,"mm",119.8,"kV"]

{"sheet":"Data","index":2,"n_rows":163,"n_cols":104,"rows_kept":163,"cut":false,"hidden":true,"merged":[[13,5,16,8]]}
["Location:","Outpatient Center"]
["Registration ID:",42]
["Registrant/Owner:","Community Hospital",null,null,null,null,"Yellow cells are to be entered manually."]
["Facility Name:","Main Campus"]
["Address:","1000 Wormwood Drive",null,null,null,null,"Blue cells are calculated automatically."]
["City, State, ZIP:","Somewhere, Else 00001"]
["Contact:","Dr. Smith"]
["Telephone:","(888) 555-1212"]
[1,"2022-04-26T11:39:20.762",7.7410000000000007E-2,"s",32.700000000000003,"kV",290.3,"mR",3765,"mR/s",0.3538,"mm",1,null,"USB",1,14.8,"Hz",null,null,null,null,null,null,null,"Standard","Multi-Sensor","Mo/Mo","Mammo",1.9769999999999999E-2,"mm",32.700000000000003,"kV",32.6,"kV",null,null,null,null,1,null,null,7.6999999999999999E-2,"s",null,null,null,null,null,null,null,null,null,null,null,null,null,null,null,null,null,null,null,null,null,null,null,null,null,null,null,null,null,null,null,null,null,null,null,null,null,null,null,null,null,null,null,null,null,null,null,null,null,null,null,null,null,null,null,null,32.700000000000003,"kV",null,"43-0001"]
["Testing by:","John Doe"]
["Test date:","2011-03-09"]
["Rapidose data file:"]
[]
["Unit:","Mammography",null,null,null,"All regulatory criteria are typical values and should be edited to match local regulatory requirements."]
["Tube ID:",1]
["System ID:",24]
[]
["Film-screen or digital?","d","(f/d)"]
[]
["GEN mfg "]
["    model"]
["    serial"]
["    date"]
["TUBE mfg"]
["    model"]
["    serial"]
["    date"]
[]
["***********************************************************************************************************"]
[]
["RADIATION  OUTPUT  MEASUREMENT:"]
[null,null,"System SID =",66,"cm"]
[null,null,"Detector to  breast support surface distance =",1.6,"cm"]
[null,null,"Breast support surface to Rapidose distance =",0.5,"cm"]
[null,null,"Point above breast support surface to calculate dose =",4.2,"cm"]
[null,null,"Inverse square correction =",{"$f":"(D32-D33-D34)^2/(D32-D33-D35)^2","v":1.1267011401640159}]
[]
["Set kVp","mAs","Target/Filter","Focal Spot","Measured mR","Measured Time (msec)","Measured kVp","kVp error",{"$f":"\"Corrected mR @ \"&D35&\" cm\"","v":"Corrected mR @ 4.2 cm"},{"$f":"\"mR/mAs @ \"&D35&\" cm\"","v":"mR/mAs @ 4.2 cm"},"HVL (mm Al)","T/F code",null,null,"kVp",{"$f":"J38","v":"mR/mAs @ 4.2 cm"},"ln(kVp)","ln(mR/mAs)"]
[24,100,{"$f":"'AG2 Data'!C3:C28","v":"Mo/Mo"},"L",{"$f":"'AG2 Data'!K3","v":653.6},{"$f":"'AG2 Data'!G3*1000","v":1070.8999999999999},{"$f":"'AG2 Data'!I3","v":23.8},{"$f":"IF(LEN(G39),ABS(G39-A39)/A39,\"\")","v":8.3333333333333037E-3},{"$f":"E39*$D$36","v":736.41186521120085},{"$f":"I39/B39","v":7.3641186521120083},{"$f":"'AG2 Data'!O3","v":0.36},{"$f":"IF(C39=\"Mo/Mo\",1,IF(C39=\"Mo/Rh\",2,IF(C39=\"Rh/Rh\",3,4)))","v":1},null,null,{"$f":"A39","v":24},{"$f":"J39","v":7.3641186521120083},{"$f":"LN(O39)","v":3.1780538303479458},1.9966193756951294]
[25,{"$f":"B39","v":100},"Mo/Mo",{"$f":"D39","v":"L"},{"$f":"'AG2 Data'!K4","v":764.9},{"$f":"'AG2 Data'!G4*1000","v":999.4},{"$f":"'AG2 Data'!I4","v":24.9},4.0000000000000565E-3,861.81370211145577,8.618137021114558,{"$f":"'AG2 Data'!O4","v":0.37},{"$f":"IF(C40=\"Mo/Mo\",1,IF(C40=\"Mo/Rh\",2,IF(C40=\"Rh/Rh\",3,4)))","v":1},null,null,{"$f":"A40","v":25},{"$f":"J40","v":8.618137021114558},3.2188758248682006,2.1538689384771565]
[26,{"$f":"B40","v":100},"Mo/Mo","L",{"$f":"'AG2 Data'!K5","v":878.4},{"$f":"'AG2 Data'!G5*1000","v":999.19999999999993},{"$f":"'AG2 Data'!I5","v":26},0,989.69428152007151,9.8969428152007151,{"$f":"'AG2 Data'!O5","v":0.38},1,null,null,{"$f":"A41","v":26},{"$f":"J41","v":9.8969428152007151},3.2580965380214821,2.2922259029046024]
[27,100,"Mo/Mo",{"$f":"D41","v":"L"},{"$f":"'AG2 Data'!K6","v":995.3},{"$f":"'AG2 Data'!G6*1000","v":999.3},{"$f":"'AG2 Data'!I6","v":27},0,1121.4056448052449,11.21405644805245,{"$f":"'AG2 Data'!O6","v":0.39},1,null,null,{"$f":"A42","v":27},{"$f":"J42","v":11.21405644805245},3.2958368660043291,2.4171680314013542]
[28,100,"Mo/Mo","L",{"$f":"'AG2 Data'!K7","v":1116},{"$f":"'AG2 Data'!G7*1000","v":998.7},{"$f":"'AG2 Data'!I7","v":28.1},3.5714285714286221E-3,1257.3984724230418,12.573984724230417,{"$f":"'AG2 Data'!O7","v":0.4},1,null,null,{"$f":"A43","v":28},{"$f":"AVERAGE(J43:J46)","v":12.571167971380007},3.3322045101752038,2.5314059356587153]
[28,100,"Mo/Mo",{"$f":"D43","v":"L"},{"$f":"'AG2 Data'!K8","v":1116},{"$f":"'AG2 Data'!G8*1000","v":998.80000000000007},{"$f":"'AG2 Data'!I8","v":28.1},3.5714285714286221E-3,1257.3984724230418,12.573984724230417,{"$f":"'AG2 Data'!O8","v":0.3},1,null,null,{"$f":"A47","v":29},{"$f":"J47","v":13.971094138033799},3.3672958299864741,2.6369904907484187]
[28,100,"Mo/Mo",{"$f":"D44","v":"L"},{"$f":"'AG2 Data'!K9","v":1115},{"$f":"'AG2 Data'!G9*1000","v":998.9},{"$f":"'AG2 Data'!I9","v":28.1},3.5714285714286221E-3,1256.2717712828778,12.562717712828778,{"$f":"'AG2 Data'!O9","v":0.3},1,null,null,{"$f":"A48","v":30},{"$f":"J48","v":15.424538608845378},3.4011973816621555,2.7359596574377849]
[28,100,"Mo/Mo",{"$f":"D45","v":"L"},{"$f":"'AG2 Data'!K10","v":1116},{"$f":"'AG2 Data'!G10*1000","v":998.5},{"$f":"'AG2 Data'!I10","v":28.1},3.5714285714286221E-3,1257.3984724230418,12.573984724230417,{"$f":"'AG2 Data'!O10","v":0.3},1,null,null,{"$f":"A49","v":32},{"$f":"J49","v":18.51169973289478},3.4657359027997265,2.918402950186604]
[29,100,"Mo/Mo","L",{"$f":"'AG2 Data'!K11","v":1240},{"$f":"'AG2 Data'!G11*1000","v":997.6},{"$f":"'AG2 Data'!I11","v":29.3},1.0344827586206921E-2,1397.1094138033798,13.971094138033799,{"$f":"'AG2 Data'!O11","v":0.31},1]
[30,100,"Mo/Mo","L",{"$f":"'AG2 Data'!K12","v":1369},{"$f":"'AG2 Data'!G12*1000","v":998},{"$f":"'AG2 Data'!I12","v":30.4},1.3333333333333286E-2,1542.4538608845378,15.424538608845378,{"$f":"'AG2 Data'!O12","v":0.32},1,null,null,null,null,"b"]
[32,100,"Mo/Mo","L",{"$f":"'AG2 Data'!K13","v":1643},{"$f":"'AG2 Data'!G13*1000","v":1064.7},{"$f":"'AG2 Data'!I13","v":32.4},1.2499999999999956E-2,1851.1699732894781,18.51169973289478,{"$f":"'AG2 Data'!O13","v":0.33},1,null,null,null,null,{"$f":"LINEST(R39:R46,Q39:Q46)","v":3.1895758507393883},-8.112035980904917]
[28,25,"Mo/Mo","L",{"$f":"'AG2 Data'!K14","v":274.2},{"$f":"'AG2 Data'!G14*1000","v":248.9},{"$f":"'AG2 Data'!I14","v":28},0,308.94145263297315,12.357658105318926,{"$f":"'AG2 Data'!O14","v":0.28999999999999998},1,null,null,null,null,{"$f":"EXP(R49)","v":2.9990764493962701E-4}]
[28,50,"Mo/Mo","L",{"$f":"'AG2 Data'!K15","v":554.4},{"$f":"'AG2 Data'!G15*1000","v":498.7},{"$f":"'AG2 Data'!I15","v":28.1},3.5714285714286221E-3,624.6431121069304,12.492862242138608,{"$f":"'AG2 Data'!O15","v":0.3},1,null,null,null,null,"a"]
[28,200,"Mo/Mo","L",{"$f":"'AG2 Data'!K16","v":2239},{"$f":"'AG2 Data'!G16*1000","v":1998.6},{"$f":"'AG2 Data'!I16","v":28.1},3.5714285714286221E-3,2522.6838528272315,12.613419264136157,{"$f":"'AG2 Data'!O16","v":0.3},1]
[28,320,"Mo/Mo","L",{"$f":"'AG2 Data'!K17","v":3587},{"$f":"'AG2 Data'!G17*1000","v":3198.5},{"$f":"'AG2 Data'!I17","v":28.1},3.5714285714286221E-3,4041.476989768325,12.629615593026015,{"$f":"'AG2 Data'!O17","v":0.3},1]
[28,{"$f":"B39","v":100},"Mo/Rh","L",{"$f":"'AG2 Data'!K18","v":915.6},{"$f":"'AG2 Data'!G18*1000","v":998.80000000000007},{"$f":"'AG2 Data'!I18","v":28.1},3.5714285714286221E-3,1031.607563934173,10.316075639341729,{"$f":"'AG2 Data'!O18","v":0.36},2]
[28,{"$f":"B40","v":100},"Rh/Rh","L",{"$f":"'AG2 Data'!K19","v":850.4},{"$f":"'AG2 Data'!G19*1000","v":1611.6999999999998},{"$f":"'AG2 Data'!I19","v":27.8},7.1428571428571175E-3,958.14664959547906,9.5814664959547908,{"$f":"'AG2 Data'!O19","v":0.37},3]
[28,{"$f":"B41","v":100},"Rh/Al","L",{"$f":"'AG2 Data'!K20","v":338.8},{"$f":"'AG2 Data'!G25*1000","v":152.19999999999999},{"$f":"'AG2 Data'!I20","v":28.1},3.5714285714286221E-3,381.72634628756862,3.8172634628756863,{"$f":"'AG2 Data'!O20","v":0.36},4]
[28,{"$f":"B42","v":100},"W/Rh","L",{"$f":"'AG2 Data'!K21","v":372.6},{"$f":"'AG2 Data'!G26*1000","v":171.4},{"$f":"'AG2 Data'!I21","v":28.1},3.5714285714286221E-3,419.80884482511237,4.1980884482511236,{"$f":"'AG2 Data'!O21","v":0.36},4]
[28,{"$f":"B43","v":100},"W/Ag","L",{"$f":"'AG2 Data'!K22","v":421.8},{"$f":"'AG2 Data'!G27*1000","v":156.9},{"$f":"'AG2 Data'!I22","v":28.1},3.5714285714286221E-3,475.2425409211819,4.7524254092118188,{"$f":"'AG2 Data'!O22","v":0.36},4]
[28,25,"Mo/Mo","S",{"$f":"'AG2 Data'!K23","v":702},{"$f":"'AG2 Data'!G28*1000","v":159.80000000000001},{"$f":"'AG2 Data'!I23","v":28.1},3.5714285714286221E-3,790.94420039513921,31.63776801580557,{"$f":"'AG2 Data'!O23","v":0.36},1]
[28,25,"Mo/Rh","S",{"$f":"'AG2 Data'!K24","v":428.8},{"$f":"'AG2 Data'!G42*1000","v":0},{"$f":"'AG2 Data'!I24","v":28.1},3.5714285714286221E-3,483.12944890233001,19.325177956093199,{"$f":"'AG2 Data'!O24","v":0.36},2]
[28,25,"Rh/Rh","S",{"$f":"'AG2 Data'!K25","v":390.7},{"$f":"'AG2 Data'!G43*1000","v":0},{"$f":"'AG2 Data'!I25","v":28.1},3.5714285714286221E-3,440.202135462081,17.608085418483242,{"$f":"'AG2 Data'!O25","v":0.36},3]
[28,25,"Rh/Al","S",{"$f":"'AG2 Data'!K26","v":440},{"$f":"'AG2 Data'!G44*1000","v":0},{"$f":"'AG2 Data'!I26","v":28.1},3.5714285714286221E-3,495.74850167216698,19.829940066886678,{"$f":"'AG2 Data'!O26","v":0.36},4]
[28,25,"W/Rh","S",{"$f":"'AG2 Data'!K27","v":402.6},{"$f":"'AG2 Data'!G45*1000","v":0},{"$f":"'AG2 Data'!I27","v":28.1},3.5714285714286221E-3,453.6098790300328,18.144395161201313,{"$f":"'AG2 Data'!O27","v":0.36},4]
[28,25,"W/Ag","S",{"$f":"'AG2 Data'!K28","v":409.9},{"$f":"'AG2 Data'!G46*1000","v":0},{"$f":"'AG2 Data'!I28","v":28.1},3.5714285714286221E-3,461.8347973532301,18.473391894129204,{"$f":"'AG2 Data'!O28","v":0.36},4]
[]
[]
["******************************"]
["MA(S)  LINEARITY"]
["mA(s) station","mR/mAs","linearity"]
[{"$f":"B50","v":25},{"$f":"J50","v":12.357658105318926}]
[{"$f":"B51","v":50},{"$f":"J51","v":12.492862242138608},{"$f":"ABS(B70-B71)/(B70+B71)","v":5.440696409140397E-3}]
[{"$f":"B43","v":100},{"$f":"AVERAGE(J43:J46)","v":12.571167971380007},{"$f":"ABS(B71-B72)/(B71+B72)","v":3.1242273718279753E-3}]
[{"$f":"B52","v":200},{"$f":"J52","v":12.613419264136157},{"$f":"ABS(B72-B73)/(B72+B73)","v":1.6776646907504618E-3}]
[{"$f":"B53","v":320},{"$f":"J53","v":12.629615593026015},{"$f":"ABS(B73-B74)/(B73+B74)","v":6.4161575585128087E-4},null,null,"Tolerance =",0.1,"linearity coefficient"]
[]
[null,{"$f":"IF(MAX(C72:C74)<=G74,\"Pass\",\"FAIL\")","v":"Pass"},null,null,null,null,null,"Mark to include on Summary page"]
["Comment:",{"$f":"IF(B76=\"Pass\",\"Radiation output linearity between different stations meets standards.\",\"Radiation output linearity between different stations does not meet standards.\")","v":"Radiation output linearity between different stations meets standards."}]
[]
["*******************************"]
["EXPOSURE REPRODUCIBILITY"]
[]
["Coefficient of Variation from above data:"]
["CV = ",{"$f":"STDEV(I43:I46)/AVERAGE(I43:I46)","v":4.4812906116959426E-4},null,null,null,"Tolerance =",0.05,"coefficient of variation"]
[]
[null,{"$f":"IF(B83<=G83,\"Pass\",\"FAIL\")","v":"Pass"},null,null,null,null,null,"Mark to include on Summary page"]
["Comment:","Exposure reproducibility is acceptable."]
[]
[]
["*******************************"]
["kVp accuracy and HVL"]
[]
["kVp accuracy standard",0.05]
["Set kVp","Target/Filter","Measured kVp","kVp error","Measured HVL","HVL lower limit","HVL upper limit","kVp pass?","HVL pass?",null,null,"HVL C-factor"]
[{"$f":"A39","v":24},{"$f":"C39","v":"Mo/Mo"},{"$f":"G39","v":23.8},{"$f":"IF(LEN(A94),(C94-A94)/A94,\"\")","v":-8.3333333333333037E-3},{"$f":"IF(LEN(K39),K39,\"\")","v":0.36},{"$f":"IF(LEN(A94),A94/100+0.03,\"\")","v":0.27},{"$f":"IF(LEN(A94),IF(L39<>4,A94/100+CHOOSE(L39,$L$94,$L$95,$L$96),\"\"),\"\")","v":0.36},{"$f":"IF(LEN(A94),ABS(D94)<=0.05,\"\")","v":true},{"$f":"IF(LEN(A94),AND(E94>=F94,E94<=G94),\"\")","v":true},null,"Mo/Mo",0.12]
[{"$f":"A40","v":25},{"$f":"C40","v":"Mo/Mo"},{"$f":"G40","v":24.9},{"$f":"IF(LEN(A95),(C95-A95)/A95,\"\")","v":-4.0000000000000565E-3},{"$f":"IF(LEN(K40),K40,\"\")","v":0.37},{"$f":"IF(LEN(A95),A95/100+0.03,\"\")","v":0.28000000000000003},{"$f":"IF(LEN(A95),IF(L40<>4,A95/100+CHOOSE(L40,$L$94,$L$95,$L$96),\"\"),\"\")","v":0.37},{"$f":"IF(LEN(A95),ABS(D95)<=0.05,\"\")","v":true},{"$f":"IF(LEN(A95),AND(E95>=F95,E95<=G95),\"\")","v":true},null,"Mo/Rh",0.19]
[26,{"$f":"C41","v":"Mo/Mo"},26,0,{"$f":"IF(LEN(K41),K41,\"\")","v":0.38},0.29000000000000004,0.38,true,true,null,"Rh/Rh",0.22]
[27,{"$f":"C42","v":"Mo/Mo"},27,0,{"$f":"IF(LEN(K42),K42,\"\")","v":0.39},0.30000000000000004,0.39,true,true]
[28,{"$f":"C43","v":"Mo/Mo"},28.1,3.5714285714286221E-3,{"$f":"IF(LEN(K43),K43,\"\")","v":0.4},0.31000000000000005,0.4,true,true]
[28,{"$f":"C47","v":"Mo/Mo"},28.1,3.5714285714286221E-3,{"$f":"IF(LEN(K47),K47,\"\")","v":0.31},0.31000000000000005,0.4,true,true]
[28,{"$f":"C48","v":"Mo/Mo"},28.1,3.5714285714286221E-3,{"$f":"IF(LEN(K48),K48,\"\")","v":0.32},0.31000000000000005,0.4,true,true]
[28,{"$f":"C49","v":"Mo/Mo"},28.1,3.5714285714286221E-3,{"$f":"IF(LEN(K49),K49,\"\")","v":0.33},0.31000000000000005,0.4,true,true]
[29,{"$f":"IF(LEN(C54),C54,\"\")","v":"Mo/Rh"},29.3,1.0344827586206921E-2,{"$f":"IF(LEN(K54),K54,\"\")","v":0.36},0.31999999999999995,0.41,true,true]
[30,"Rh/Rh",30.4,1.3333333333333286E-2,{"$f":"IF(LEN(K55),K55,\"\")","v":0.37},0.32999999999999996,0.42,true,true]
[32,"Rh/Al",32.4,1.2499999999999956E-2,0.36,0.35,0.44,true,true]
[28,"W/Rh",28,0,0.36,0.31000000000000005,0.4,true,true]
[28,"W/Ag",28.1,3.5714285714286221E-3,0.36,0.31000000000000005,0.4,true,true]
[28,"Mo/Mo",28.1,3.5714285714286221E-3,0.36,0.31000000000000005,0.4,true,true]
[28,"Mo/Rh",28.1,3.5714285714286221E-3,0.36,0.31000000000000005,0.4,true,true]
[28,"Rh/Rh",28.1,3.5714285714286221E-3,0.36,0.31000000000000005,0.47000000000000003,true,true]
[28,"Rh/Al",27.8,-7.1428571428571175E-3,0.36,0.31000000000000005,0.5,true,true]
[28,"W/Rh",28.1,3.5714285714286221E-3,0.36,0.31000000000000005,{"$f":"IF(LEN(A111),IF(L56<>4,A111/100+CHOOSE(L56,$L$94,$L$95,$L$96),\"\"),\"\")","v":""},true,true]
[28,"W/Ag",28.1,{"$f":"IF(LEN(A112),(C112-A112)/A112,\"\")","v":3.5714285714286221E-3},0.36,0.31000000000000005,"",true,true]
[]
["kVp accuracy",{"$f":"IF(AND(H94:H112),\"Pass\",\"FAIL\")","v":"Pass"},null,null,null,null,null,"Mark to include on Summary page"]
["Comment:",{"$f":"IF(B114=\"Pass\",\"kVp accuracy meets applicable standards.\",\"kVp accuracy does not meet standards.\")","v":"kVp accuracy meets applicable standards."}]
[]
["HVL",{"$f":"IF(AND(I94:I112),\"Pass\",\"FAIL\")","v":"Pass"},null,null,null,null,null,"Mark to include on Summary page"]
["Comment: ",{"$f":"IF(B117=\"Pass\",\"X-ray beam filtration is adequate.\",\"X-ray beam filtration does not meet standards.\")","v":"X-ray beam filtration is adequate."}]
[]
["***********************************"]
["RADIATION OUTPUT"]
[]
[{"$f":"O38","v":"kVp"},{"$f":"P38","v":"mR/mAs @ 4.2 cm"}]
[{"$f":"O39","v":24},7.3641186521120083]
[25,8.618137021114558]
[26,9.8969428152007151]
[27,11.21405644805245]
[{"$f":"O43","v":28},12.571167971380007]
[29,13.971094138033799]
[30,15.424538608845378]
[32,18.51169973289478]
[]
["Output acceptable?","Pass"]
[]
[null,null,null,null,null,"No standard",null,"Mark to include on Summary page"]
["Comment: ","Radiation output is typical."]
[]
[]
["***********************************"]
["RADIATION AND KV WAVEFORM"]
["Capture the waveform image and paste it in the appropriate section of the Report."]
[]
["Waveform acceptable?","Pass"]
[]
[null,null,null,null,null,"No standard",null,"Mark to include on Summary page"]
["Comment: ","Waveform is typical."]
[]
[]
["*******************************"]
["General Comments"]
[null,null,null,null,null,null,null,"Mark to include on Summary page"]
[null,"Unit meets regulatory requirements.",null,null,null,null,null,"x",null,null,null,null,null,{"$f":"IF(LEN(H115),B115&\" \",\"\")","v":""}]
[null,null,null,null,null,null,null,null,null,null,null,null,null,{"$f":"IF(LEN(H118),B118&\" \",\"\")","v":""}]
[null,null,null,null,null,null,null,null,null,null,null,null,null,{"$f":"IF(LEN(H146),B146&\" \",\"\")","v":""}]
[null,null,null,null,null,null,null,null,null,null,null,null,null,{"$f":"IF(LEN(H77),B77&\" \",\"\")","v":""}]
["*******************************",null,null,null,null,null,null,null,null,null,null,null,null,{"$f":"IF(LEN(H86),B86&\" \",\"\")","v":""}]
["Summary Comments ",null,null,null,null,null,null,null,null,null,null,null,null,{"$f":"IF(LEN(H136),B136&\" \",\"\")","v":""}]
[null,{"$f":"N154&N155&N156&N158&N159","v":"Unit meets regulatory requirements. "},null,null,null,null,null,null,null,null,null,null,null,{"$f":"IF(LEN(H146),B146&\" \",\"\")","v":""}]
[null,null,null,null,null,null,null,null,null,null,null,null,null,{"$f":"IF(LEN(H152),B152&\" \",\"\")","v":"Unit meets regulatory requirements. "}]
[]
[]
[]
["*****************************"]

{"sheet":"Report","index":3,"n_rows":151,"n_cols":9,"rows_kept":151,"cut":false,"hidden":false,"merged":[[0,0,0,9],[23,0,23,9],[38,0,38,9],[33,1,35,9]]}
["Mammographic Unit Performance Report"]
[]
[null,"Facility Identification",null,null,null,"System Identification"]
[null,{"$f":"Data!B1","v":"Outpatient Center"},null,null,null,{"$f":"Data!B14","v":"Mammography"}]
[null,{"$f":"\"Registration ID \"&Data!B2","v":"Registration ID 42"},null,null,null,{"$f":"Data!B15","v":1}]
[null,{"$f":"Data!B3","v":"Community Hospital"},null,null,null,"Unique ID",null,null,{"$f":"Data!B16","v":24}]
[null,{"$f":"Data!B4","v":"Main Campus"},null,null,null,"Control Manufacturer",null,null,{"$f":"Data!B20","v":0}]
[null,{"$f":"Data!B5","v":"1000 Wormwood Drive"},null,null,null,"Control Model",null,null,{"$f":"Data!B21","v":0}]
[null,{"$f":"Data!B6","v":"Somewhere, Else 00001"},null,null,null,"Control S/N",null,null,{"$f":"Data!B22","v":0}]
[null,{"$f":"Data!B7","v":"Dr. Smith"},null,null,null,"Control Date",null,null,{"$f":"Data!B23","v":0}]
[null,{"$f":"Data!B8","v":"(888) 555-1212"},null,null,null,"Tube Manufacturer",null,null,{"$f":"Data!B24","v":0}]
[null,null,null,null,null,"Tube Model",null,null,{"$f":"Data!B25","v":0}]
[null,null,null,null,null,"Tube S/N",null,null,{"$f":"Data!B26","v":0}]
[null,null,null,null,null,"Tube Date",null,null,{"$f":"Data!B27","v":0}]
[]
["Test Date",{"$f":"Data!B11","v":40611}]
["Tested by",{"$f":"Data!B10","v":"John Doe"}]
[]
[]
[]
["Signature"]
[]
[]
["Summary of the results of this performance survey"]
[null," (N/A = not applicable, N/M = not measured)"]
[]
[null,{"$f":"Data!B133","v":"Pass"},"   Radiation output"]
[null,{"$f":"Data!B117","v":"Pass"},"   Beam quality"]
[null,{"$f":"Data!B85","v":"Pass"},"   Reproducibility of radiation exposures"]
[null,{"$f":"Data!B114","v":"Pass"},"   kVp accuracy"]
[null,{"$f":"Data!B76","v":"Pass"},"   mAs radiation output linearity"]
[]
["General Comments:"]
[" ",{"$f":"IF(LEN(Data!B158),Data!B158,\"\")","v":"Unit meets regulatory requirements. "}]
[" "]
[" "]
[]
[]
["X-Ray Machine Performance "]
[]
[]
[{"$f":"Data!B133","v":"Pass"},"Radiation Output"]
[null,null,null,null," Measurement distance =",{"$f":"Data!D34&\" above breast support surface\"","v":"0.5 above breast support surface"}]
[]
[null,"Set kVp",{"$f":"Data!P38","v":"mR/mAs @ 4.2 cm"}]
[null,{"$f":"Data!O39","v":24},{"$f":"Data!P39","v":7.3641186521120083}]
[null,{"$f":"Data!O40","v":25},{"$f":"Data!P40","v":8.618137021114558}]
[null,{"$f":"Data!O41","v":26},{"$f":"Data!P41","v":9.8969428152007151}]
[null,{"$f":"Data!O42","v":27},{"$f":"Data!P42","v":11.21405644805245}]
[null,{"$f":"Data!O43","v":28},{"$f":"Data!P43","v":12.571167971380007}]
[null,{"$f":"Data!O44","v":29},{"$f":"Data!P44","v":13.971094138033799}]
[null,{"$f":"Data!O45","v":30},{"$f":"Data!P45","v":15.424538608845378}]
[null,{"$f":"Data!O46","v":32},{"$f":"Data!P46","v":18.51169973289478}]
[]
[null,"Comment:",{"$f":"Data!B136","v":"Radiation output is typical."}]
[]
[]
[{"$f":"Data!B114","v":"Pass"},"kVp Accuracy"]
[]
[null,{"$f":"Data!A93","v":"Set kVp"},{"$f":"Data!C93","v":"Measured kVp"},{"$f":"Data!D93","v":"kVp error"}]
[null,{"$f":"Data!A94","v":24},{"$f":"Data!C94","v":23.8},{"$f":"Data!D94","v":-8.3333333333333037E-3},null,20,{"$f":"Data!B92","v":0.05}]
[null,{"$f":"Data!A95","v":25},{"$f":"Data!C95","v":24.9},{"$f":"Data!D95","v":-4.0000000000000565E-3},null,40,{"$f":"Data!B92","v":0.05}]
[null,{"$f":"Data!A96","v":26},{"$f":"Data!C96","v":26},{"$f":"Data!D96","v":0},null,20,{"$f":"-G61","v":-0.05}]
[null,{"$f":"Data!A97","v":27},{"$f":"Data!C97","v":27},{"$f":"Data!D97","v":0},null,40,{"$f":"-G62","v":-0.05}]
[null,{"$f":"Data!A98","v":28},{"$f":"Data!C98","v":28.1},{"$f":"Data!D98","v":3.5714285714286221E-3}]
[null,{"$f":"Data!A99","v":28},{"$f":"Data!C99","v":28.1},{"$f":"Data!D99","v":3.5714285714286221E-3}]
[null,{"$f":"Data!A100","v":28},{"$f":"Data!C100","v":28.1},{"$f":"Data!D100","v":3.5714285714286221E-3}]
[null,{"$f":"Data!A101","v":28},{"$f":"Data!C101","v":28.1},{"$f":"Data!D101","v":3.5714285714286221E-3}]
[]
[null,{"$f":"\"The kVp error limit is \"&TEXT(Data!B92,\"0%.\")","v":"The kVp error limit is 5%."}]
[]
[null,"Comment:",{"$f":"Data!B115","v":"kVp accuracy meets applicable standards."}]
[]
[]
[{"$f":"Data!B117","v":"Pass"},"Beam Quality"]
[]
[null,{"$f":"Data!A93","v":"Set kVp"},"Target / Filter",{"$f":"Data!E93","v":"Measured HVL"},{"$f":"Data!F93","v":"HVL lower limit"},{"$f":"Data!G93","v":"HVL upper limit"}]
[null,{"$f":"Data!A94","v":24},{"$f":"Data!B94","v":"Mo/Mo"},{"$f":"Data!E94","v":0.36},{"$f":"Data!F94","v":0.27},{"$f":"Data!G94","v":0.36}]
[null,{"$f":"Data!A95","v":25},{"$f":"Data!B95","v":"Mo/Mo"},{"$f":"Data!E95","v":0.37},{"$f":"Data!F95","v":0.28000000000000003},{"$f":"Data!G95","v":0.37}]
[null,{"$f":"Data!A96","v":26},{"$f":"Data!B96","v":"Mo/Mo"},{"$f":"Data!E96","v":0.38},{"$f":"Data!F96","v":0.29000000000000004},{"$f":"Data!G96","v":0.38}]
[null,{"$f":"Data!A97","v":27},{"$f":"Data!B97","v":"Mo/Mo"},{"$f":"Data!E97","v":0.39},{"$f":"Data!F97","v":0.30000000000000004},{"$f":"Data!G97","v":0.39}]
[null,{"$f":"Data!A98","v":28},{"$f":"Data!B98","v":"Mo/Mo"},{"$f":"Data!E98","v":0.4},{"$f":"Data!F98","v":0.31000000000000005},{"$f":"Data!G98","v":0.4}]
[null,{"$f":"Data!A99","v":28},{"$f":"Data!B99","v":"Mo/Mo"},{"$f":"Data!E99","v":0.31},{"$f":"Data!F99","v":0.31000000000000005},{"$f":"Data!G99","v":0.4}]
[null,{"$f":"Data!A100","v":28},{"$f":"Data!B100","v":"Mo/Mo"},{"$f":"Data!E100","v":0.32},{"$f":"Data!F100","v":0.31000000000000005},{"$f":"Data!G100","v":0.4}]
[null,{"$f":"Data!A101","v":28},{"$f":"Data!B101","v":"Mo/Mo"},{"$f":"Data!E101","v":0.33},{"$f":"Data!F101","v":0.31000000000000005},{"$f":"Data!G101","v":0.4}]
[null,{"$f":"Data!A102","v":29},{"$f":"Data!B102","v":"Mo/Rh"},{"$f":"Data!E102","v":0.36},{"$f":"Data!F102","v":0.31999999999999995},{"$f":"Data!G102","v":0.41}]
[null,{"$f":"Data!A103","v":30},{"$f":"Data!B103","v":"Rh/Rh"},{"$f":"Data!E103","v":0.37},{"$f":"Data!F103","v":0.32999999999999996},{"$f":"Data!G103","v":0.42}]
[null,{"$f":"Data!A104","v":32},{"$f":"Data!B104","v":"Rh/Al"},{"$f":"Data!E104","v":0.36},{"$f":"Data!F104","v":0.35},{"$f":"Data!G104","v":0.44}]
[null,{"$f":"Data!A105","v":28},{"$f":"Data!B105","v":"W/Rh"},{"$f":"Data!E105","v":0.36},{"$f":"Data!F105","v":0.31000000000000005},{"$f":"Data!G105","v":0.4}]
[null,{"$f":"Data!A106","v":28},{"$f":"Data!B106","v":"W/Ag"},{"$f":"Data!E106","v":0.36},{"$f":"Data!F106","v":0.31000000000000005},{"$f":"Data!G106","v":0.4}]
[null,{"$f":"Data!A107","v":28},{"$f":"Data!B107","v":"Mo/Mo"},{"$f":"Data!E107","v":0.36},{"$f":"Data!F107","v":0.31000000000000005},{"$f":"Data!G107","v":0.4}]
[null,{"$f":"Data!A108","v":28},{"$f":"Data!B108","v":"Mo/Rh"},{"$f":"Data!E108","v":0.36},{"$f":"Data!F108","v":0.31000000000000005},{"$f":"Data!G108","v":0.4}]
[null,{"$f":"Data!A109","v":28},{"$f":"Data!B109","v":"Rh/Rh"},{"$f":"Data!E109","v":0.36},{"$f":"Data!F109","v":0.31000000000000005},{"$f":"Data!G109","v":0.47000000000000003}]
[null,{"$f":"Data!A110","v":28},{"$f":"Data!B110","v":"Rh/Al"},{"$f":"Data!E110","v":0.36},{"$f":"Data!F110","v":0.31000000000000005},{"$f":"Data!G110","v":0.5}]
[null,{"$f":"Data!A111","v":28},{"$f":"Data!B111","v":"W/Rh"},{"$f":"Data!E111","v":0.36},{"$f":"Data!F111","v":0.31000000000000005},{"$f":"Data!G111","v":""}]
[null,{"$f":"Data!A112","v":28},{"$f":"Data!B112","v":"W/Ag"},{"$f":"Data!E112","v":0.36},{"$f":"Data!F112","v":0.31000000000000005},{"$f":"Data!G112","v":""}]
[]
[null,"Measured HVL must exceed the stated limit."]
[]
[null,"Comment:",{"$f":"Data!B118","v":"X-ray beam filtration is adequate."}]
[{"$f":"Data!B85","v":"Pass"},"Exposure Reproducibility"]
[]
[null,"Exposure","Measured mR"]
[null,"#1",{"$f":"Data!E43","v":1116}]
[null,"#2",{"$f":"Data!E44","v":1116}]
[null,"#3",{"$f":"Data!E45","v":1115}]
[null,"#4",{"$f":"Data!E46","v":1116}]
[null,"Average",{"$f":"AVERAGE(C104:C107)","v":1115.75}]
[null,"Std. Dev",{"$f":"STDEV(C104:C107)","v":0.5}]
[null,"CV",{"$f":"C109/C108","v":4.4812906116961686E-4}]
[null,{"$f":"\"CV must be less than \"&TEXT(Data!G83,\"0%.\")","v":"CV must be less than 5%."}]
[]
[null,"Comment:",{"$f":"Data!B86","v":"Exposure reproducibility is acceptable."}]
[]
[]
[{"$f":"Data!B76","v":"Pass"},"mAs Linearity"]
[]
[]
[null,"mAs","mR/mAs","Linearity Coeff."]
[null,{"$f":"Data!A70","v":25},{"$f":"Data!B70","v":12.357658105318926}]
[null,{"$f":"Data!A71","v":50},{"$f":"Data!B71","v":12.492862242138608},{"$f":"Data!C71","v":5.440696409140397E-3},null,null,0,0.1]
[null,{"$f":"Data!A72","v":100},{"$f":"Data!B72","v":12.571167971380007},{"$f":"Data!C72","v":3.1242273718279753E-3},null,null,1000,0.1]
[null,{"$f":"Data!A73","v":200},{"$f":"Data!B73","v":12.613419264136157},{"$f":"Data!C73","v":1.6776646907504618E-3}]
[null,{"$f":"Data!A74","v":320},{"$f":"Data!B74","v":12.629615593026015},{"$f":"Data!C74","v":6.4161575585128087E-4}]
[]
[null,null,null,{"$f":"\"Linearity coefficient must be less than \"&FIXED(Data!G74,2)&\".\"","v":"Linearity coefficient must be less than 0.10."}]
[]
[null,"Comment:",{"$f":"Data!B77","v":"Radiation output linearity between different stations meets standards."}]
[]
[]
[{"$f":"Data!B143","v":"Pass"},"Radiation and kV Waveforms"]
[]
[]
[]
[]
[]
[]
[]
[]
[]
[]
[]
[]
[]
[]
[]
[]
[]
[]
[]
[null,"Comment:",{"$f":"Data!B146","v":"Waveform is typical."}]